Reaction Details
TargetAcetylcholinesterase
LigandBDBM50359395
Substrate/Competitorn/a
Meas. Tech.ChEMBL_793318 (CHEMBL1931821)
IC50 260±n/a nM
Citation Bolea, IJuárez-Jiménez, Jde Los Ríos, CChioua, MPouplana, RLuque, FJUnzeta, MMarco-Contelles, JSamadi, A Synthesis, biological evaluation, and molecular modeling of donepezil and N-[(5-(benzyloxy)-1-methyl-1H-indol-2-yl)methyl]-N-methylprop-2-yn-1-amine hybrids as new multipotent cholinesterase/monoamine oxidase inhibitors for the treatment of Alzheimer's disease. J Med Chem54:8251-70 (2011) 
 
Acetylcholinesterase
Name:Acetylcholinesterase
Type:Enzyme
Mol. Mass.:71812.79
Organism:Electrophorus electricus (Electric eel)
Description:n/a
Residue:633
BDBM50359395
NameBDBM50359395
Synonyms:CHEMBL1929422
TypeSmall organic molecule
Emp. Form.C30H39N3O
Mol. Mass.457.6502
SMILESCN(CC#C)Cc1cc2cc(OCCCCC3CCN(Cc4ccccc4)CC3)ccc2n1C