Reaction Details
TargetCell division protein FtsZ
LigandBDBM50359398
Substrate/Competitorn/a
Meas. Tech.ChEMBL_793371 (CHEMBL1931925)
IC50 34200±n/a nM
Citation Mathew, BSrivastava, SRoss, LJSuling, WJWhite, ELWoolhiser, LKLenaerts, AJReynolds, RC Novel pyridopyrazine and pyrimidothiazine derivatives as FtsZ inhibitors. Bioorg Med Chem19:7120-8 (2011) 
 
Cell division protein FtsZ
Name:Cell division protein FtsZ
Type:PROTEIN
Mol. Mass.:38736.30
Organism:Mycobacterium tuberculosis
Description:ChEMBL_1470459
Residue:379
BDBM50359398
NameBDBM50359398
Synonyms:CHEMBL110168
TypeSmall organic molecule
Emp. Form.C31H38N6O2
Mol. Mass.526.6724
SMILESCCOC(=O)Nc1cc(NC(C)CCCN(CC)CC)c2nc(-c3ccccc3)c(nc2n1)-c1ccccc1