Reaction Details
TargetCell division protein FtsZ
LigandBDBM50359406
Substrate/Competitorn/a
Meas. Tech.ChEMBL_793371 (CHEMBL1931925)
IC50 16400±n/a nM
Citation Mathew, BSrivastava, SRoss, LJSuling, WJWhite, ELWoolhiser, LKLenaerts, AJReynolds, RC Novel pyridopyrazine and pyrimidothiazine derivatives as FtsZ inhibitors. Bioorg Med Chem19:7120-8 (2011) 
 
Cell division protein FtsZ
Name:Cell division protein FtsZ
Type:PROTEIN
Mol. Mass.:38736.30
Organism:Mycobacterium tuberculosis
Description:ChEMBL_1470459
Residue:379
BDBM50359406
NameBDBM50359406
Synonyms:CHEMBL1926717
TypeSmall organic molecule
Emp. Form.C26H32N6O4
Mol. Mass.492.5701
SMILESCCOC(=O)Nc1cc(NCCCCN(CC)CC)c2nc(-c3ccco3)c(nc2n1)-c1ccco1