Reaction Details
TargetCell division protein FtsZ
LigandBDBM50359411
Substrate/Competitorn/a
Meas. Tech.ChEMBL_793371 (CHEMBL1931925)
IC50 34100±n/a nM
Citation Mathew, BSrivastava, SRoss, LJSuling, WJWhite, ELWoolhiser, LKLenaerts, AJReynolds, RC Novel pyridopyrazine and pyrimidothiazine derivatives as FtsZ inhibitors. Bioorg Med Chem19:7120-8 (2011) 
 
Cell division protein FtsZ
Name:Cell division protein FtsZ
Type:PROTEIN
Mol. Mass.:38736.30
Organism:Mycobacterium tuberculosis
Description:ChEMBL_1470459
Residue:379
BDBM50359411
NameBDBM50359411
Synonyms:CHEMBL1926723
TypeSmall organic molecule
Emp. Form.C22H24N6O4
Mol. Mass.436.4638
SMILESCCOC(=O)Nc1cc(NCCN(C)C)c2nc(-c3ccco3)c(nc2n1)-c1ccco1