Reaction Details
TargetCell division protein FtsZ
LigandBDBM50359413
Substrate/Competitorn/a
Meas. Tech.ChEMBL_793371 (CHEMBL1931925)
IC50 29500±n/a nM
Citation Mathew, BSrivastava, SRoss, LJSuling, WJWhite, ELWoolhiser, LKLenaerts, AJReynolds, RC Novel pyridopyrazine and pyrimidothiazine derivatives as FtsZ inhibitors. Bioorg Med Chem19:7120-8 (2011) 
 
Cell division protein FtsZ
Name:Cell division protein FtsZ
Type:PROTEIN
Mol. Mass.:38736.30
Organism:Mycobacterium tuberculosis
Description:ChEMBL_1470459
Residue:379
BDBM50359413
NameBDBM50359413
Synonyms:CHEMBL1926725
TypeSmall organic molecule
Emp. Form.C24H30N6S2
Mol. Mass.466.665
SMILESCCN(CC)CCCC(C)Nc1cc(N)nc2nc(-c3cccs3)c(nc12)-c1cccs1