Reaction Details
TargetNADPH oxidase 1
LigandBDBM50359525
Substrate/Competitorn/a
Meas. Tech.ChEMBL_792877 (CHEMBL1931062)
Ki 119±n/a nM
Citation Gaggini, FLaleu, BOrchard, MFioraso-Cartier, LCagnon, LHoungninou-Molango, SGradia, ADuboux, GMerlot, CHeitz, FSzyndralewiez, CPage, P Design, synthesis and biological activity of original pyrazolo-pyrido-diazepine, -pyrazine and -oxazine dione derivatives as novel dual Nox4/Nox1 inhibitors. Bioorg Med Chem19:6989-99 (2011) 
 
NADPH oxidase 1
Name:NADPH oxidase 1
Type:PROTEIN
Mol. Mass.:64890.44
Organism:Homo sapiens (Human)
Description:ChEMBL_792877
Residue:564
BDBM50359525
NameBDBM50359525
Synonyms:CHEMBL1927146
TypeSmall organic molecule
Emp. Form.C16H15ClN4O2
Mol. Mass.330.769
SMILESClc1ccccc1-n1[nH]c2cc(=O)n3CCCNCc3c2c1=O