Reaction Details
TargetNADPH oxidase 1
LigandBDBM50359521
Substrate/Competitorn/a
Meas. Tech.ChEMBL_792877 (CHEMBL1931062)
Ki 212±n/a nM
Citation Gaggini, FLaleu, BOrchard, MFioraso-Cartier, LCagnon, LHoungninou-Molango, SGradia, ADuboux, GMerlot, CHeitz, FSzyndralewiez, CPage, P Design, synthesis and biological activity of original pyrazolo-pyrido-diazepine, -pyrazine and -oxazine dione derivatives as novel dual Nox4/Nox1 inhibitors. Bioorg Med Chem19:6989-99 (2011) 
 
NADPH oxidase 1
Name:NADPH oxidase 1
Type:PROTEIN
Mol. Mass.:64890.44
Organism:Homo sapiens (Human)
Description:ChEMBL_792877
Residue:564
BDBM50359521
NameBDBM50359521
Synonyms:CHEMBL1927159
TypeSmall organic molecule
Emp. Form.C25H26N4O4
Mol. Mass.446.4983
SMILESCOc1cccc(CN2CCCn3c(C2)c2c(cc3=O)[nH]n(-c3ccccc3OC)c2=O)c1