Reaction Details
TargetCytochrome b-245 heavy chain
LigandBDBM50359533
Substrate/Competitorn/a
Meas. Tech.ChEMBL_792878 (CHEMBL1931063)
Ki 780±n/a nM
Citation Gaggini, FLaleu, BOrchard, MFioraso-Cartier, LCagnon, LHoungninou-Molango, SGradia, ADuboux, GMerlot, CHeitz, FSzyndralewiez, CPage, P Design, synthesis and biological activity of original pyrazolo-pyrido-diazepine, -pyrazine and -oxazine dione derivatives as novel dual Nox4/Nox1 inhibitors. Bioorg Med Chem19:6989-99 (2011) 
 
Cytochrome b-245 heavy chain
Name:Cytochrome b-245 heavy chain
Type:Enzyme
Mol. Mass.:65355.82
Organism:Homo sapiens (Human)
Description:P04839
Residue:570
BDBM50359533
NameBDBM50359533
Synonyms:CHEMBL1927154
TypeSmall organic molecule
Emp. Form.C24H23ClN4O3
Mol. Mass.450.917
SMILESCOc1ccc(CN2CCCn3c(C2)c2c(cc3=O)[nH]n(-c3ccccc3Cl)c2=O)cc1