Reaction Details
TargetNADPH oxidase 4
LigandBDBM50359524
Substrate/Competitorn/a
Meas. Tech.ChEMBL_792879 (CHEMBL1931064)
Ki 103±n/a nM
Citation Gaggini, FLaleu, BOrchard, MFioraso-Cartier, LCagnon, LHoungninou-Molango, SGradia, ADuboux, GMerlot, CHeitz, FSzyndralewiez, CPage, P Design, synthesis and biological activity of original pyrazolo-pyrido-diazepine, -pyrazine and -oxazine dione derivatives as novel dual Nox4/Nox1 inhibitors. Bioorg Med Chem19:6989-99 (2011) 
 
NADPH oxidase 4
Name:NADPH oxidase 4
Type:PROTEIN
Mol. Mass.:66954.54
Organism:Homo sapiens (Human)
Description:ChEMBL_792879
Residue:578
BDBM50359524
NameBDBM50359524
Synonyms:CHEMBL1927145
TypeSmall organic molecule
Emp. Form.C21H23ClN4O4
Mol. Mass.430.885
SMILESCC(C)(C)OC(=O)N1CCCn2c(C1)c1c(cc2=O)[nH]n(-c2ccccc2Cl)c1=O