Reaction Details
TargetNADPH oxidase 4
LigandBDBM50359532
Substrate/Competitorn/a
Meas. Tech.ChEMBL_792879 (CHEMBL1931064)
Ki 112±n/a nM
Citation Gaggini, FLaleu, BOrchard, MFioraso-Cartier, LCagnon, LHoungninou-Molango, SGradia, ADuboux, GMerlot, CHeitz, FSzyndralewiez, CPage, P Design, synthesis and biological activity of original pyrazolo-pyrido-diazepine, -pyrazine and -oxazine dione derivatives as novel dual Nox4/Nox1 inhibitors. Bioorg Med Chem19:6989-99 (2011) 
 
NADPH oxidase 4
Name:NADPH oxidase 4
Type:PROTEIN
Mol. Mass.:66954.54
Organism:Homo sapiens (Human)
Description:ChEMBL_792879
Residue:578
BDBM50359532
NameBDBM50359532
Synonyms:CHEMBL1927153
TypeSmall organic molecule
Emp. Form.C24H23ClN4O3
Mol. Mass.450.917
SMILESCOc1cccc(CN2CCCn3c(C2)c2c(cc3=O)[nH]n(-c3ccccc3Cl)c2=O)c1