Reaction Details
TargetNADPH oxidase 4
LigandBDBM50359520
Substrate/Competitorn/a
Meas. Tech.ChEMBL_792879 (CHEMBL1931064)
Ki 93±n/a nM
Citation Gaggini, FLaleu, BOrchard, MFioraso-Cartier, LCagnon, LHoungninou-Molango, SGradia, ADuboux, GMerlot, CHeitz, FSzyndralewiez, CPage, P Design, synthesis and biological activity of original pyrazolo-pyrido-diazepine, -pyrazine and -oxazine dione derivatives as novel dual Nox4/Nox1 inhibitors. Bioorg Med Chem19:6989-99 (2011) 
 
NADPH oxidase 4
Name:NADPH oxidase 4
Type:PROTEIN
Mol. Mass.:66954.54
Organism:Homo sapiens (Human)
Description:ChEMBL_792879
Residue:578
BDBM50359520
NameBDBM50359520
Synonyms:CHEMBL1927158
TypeSmall organic molecule
Emp. Form.C23H23N5O3
Mol. Mass.417.4604
SMILESCOc1ccccc1-n1[nH]c2cc(=O)n3CCCN(Cc4ccccn4)Cc3c2c1=O