Reaction Details
TargetSodium-dependent dopamine transporter
LigandBDBM50359597
Substrate/Competitorn/a
Meas. Tech.ChEMBL_793034 (CHEMBL1932600)
Ki 41±n/a nM
Citation Cararas, SAIzenwasser, SWade, DHousman, AVerma, ALomenzo, SATrudell, ML Further structure-activity relationship studies on 8-substituted-3-[2-(diarylmethoxyethylidenyl)]-8-azabicyclo[3.2.1]octane derivatives at monoamine transporters. Bioorg Med Chem19:7551-8 (2011) 
 
Sodium-dependent dopamine transporter
Name:Sodium-dependent dopamine transporter
Type:Multi-pass membrane protein
Mol. Mass.:68749.45
Organism:Rattus norvegicus (rat)
Description:P23977
Residue:619
BDBM50359597
NameBDBM50359597
Synonyms:CHEMBL1927871
TypeSmall organic molecule
Emp. Form.C25H29F2NO
Mol. Mass.397.5007
SMILESCCCN1[C@H]2CC[C@@H]1C\C(C2)=C/COC(c1ccc(F)cc1)c1ccc(F)cc1