Reaction Details
TargetProstaglandin E2 receptor EP4 subtype
LigandBDBM50359616
Substrate/Competitorn/a
Meas. Tech.ChEMBL_793158 (CHEMBL1931472)
EC50 5.7±n/a nM
Citation Hayashi, RHosono, YNakatsuji, KTanaka, YMori, TKanno, TMakita, KMoriwaki, MOhyama, TOchi, YInada, CIsogaya, M Efficient synthesis of a novel m-phenylene derivative as a selective EP4 agonist inducing follicular growth and maturation in the ovary. Bioorg Med Chem Lett21:7505-8 (2011) 
 
Prostaglandin E2 receptor EP4 subtype
Name:Prostaglandin E2 receptor EP4 subtype
Type:PROTEIN
Mol. Mass.:53381.06
Organism:Oryctolagus cuniculus
Description:ChEMBL_793158
Residue:488
BDBM50359616
NameBDBM50359616
Synonyms:CHEMBL1928221
TypeSmall organic molecule
Emp. Form.C24H32O5
Mol. Mass.400.5079
SMILESO[C@@H](CC1CCCCC1)\C=C\[C@H]1[C@H](O)C[C@@H]2Oc3c(cccc3CCC(O)=O)[C@H]12