Reaction Details
TargetThymidylate kinase
LigandBDBM50359618
Substrate/Competitorn/a
Meas. Tech.ChEMBL_793312 (CHEMBL1931815)
Ki 2800±n/a nM
Citation Van Poecke, SMunier-Lehmann, HHelynck, OFroeyen, MVan Calenbergh, S Synthesis and inhibitory activity of thymidine analogues targeting Mycobacterium tuberculosis thymidine monophosphate kinase. Bioorg Med Chem19:7603-11 (2011) 
 
Thymidylate kinase
Name:Thymidylate kinase
Type:PROTEIN
Mol. Mass.:22636.29
Organism:Mycobacterium tuberculosis
Description:ChEMBL_208218
Residue:214
BDBM50359618
NameBDBM50359618
Synonyms:CHEMBL1928428
TypeSmall organic molecule
Emp. Form.C18H18ClF3N4O5
Mol. Mass.462.808
SMILESCc1cn([C@H]2C[C@H](NC(=O)Nc3ccc(Cl)c(c3)C(F)(F)F)[C@@H](CO)O2)c(=O)[nH]c1=O