Reaction Details
TargetThymidylate kinase
LigandBDBM50314839
Substrate/Competitorn/a
Meas. Tech.ChEMBL_793312 (CHEMBL1931815)
Ki 2100±n/a nM
Citation Van Poecke, SMunier-Lehmann, HHelynck, OFroeyen, MVan Calenbergh, S Synthesis and inhibitory activity of thymidine analogues targeting Mycobacterium tuberculosis thymidine monophosphate kinase. Bioorg Med Chem19:7603-11 (2011) 
 
Thymidylate kinase
Name:Thymidylate kinase
Type:PROTEIN
Mol. Mass.:22636.29
Organism:Mycobacterium tuberculosis
Description:ChEMBL_208218
Residue:214
BDBM50314839
NameBDBM50314839
Synonyms:3'-(4-Chlorophenyl-1,2,3-triazol-1-yl)-3'-deoxy-beta-D-thymidine | CHEMBL1089867
TypeSmall organic molecule
Emp. Form.C18H18ClN5O4
Mol. Mass.403.82
SMILESCc1cn([C@H]2C[C@@H]([C@@H](CO)O2)n2cc(nn2)-c2ccc(Cl)cc2)c(=O)[nH]c1=O