Reaction Details
TargetThymidylate kinase
LigandBDBM50359623
Substrate/Competitorn/a
Meas. Tech.ChEMBL_793312 (CHEMBL1931815)
Ki 73000±n/a nM
Citation Van Poecke, SMunier-Lehmann, HHelynck, OFroeyen, MVan Calenbergh, S Synthesis and inhibitory activity of thymidine analogues targeting Mycobacterium tuberculosis thymidine monophosphate kinase. Bioorg Med Chem19:7603-11 (2011) 
 
Thymidylate kinase
Name:Thymidylate kinase
Type:PROTEIN
Mol. Mass.:22636.29
Organism:Mycobacterium tuberculosis
Description:ChEMBL_208218
Residue:214
BDBM50359623
NameBDBM50359623
Synonyms:CHEMBL1928433
TypeSmall organic molecule
Emp. Form.C18H17ClF3N7O4
Mol. Mass.487.82
SMILESCc1cn([C@H]2C[C@H](O)[C@@H](CNc3nnnn3-c3ccc(Cl)c(c3)C(F)(F)F)O2)c(=O)[nH]c1=O