Reaction Details
TargetMineralocorticoid receptor
LigandBDBM50359651
Substrate/Competitorn/a
Meas. Tech.ChEMBL_792910 (CHEMBL1929756)
IC50 12±n/a nM
Citation Hasui, TMatsunaga, NOra, TOhyabu, NNishigaki, NImura, YIgata, YMatsui, HMotoyaji, TTanaka, THabuka, NSogabe, SOno, MSiedem, CSTang, TPGauthier, CDe Meese, LABoyd, SAFukumoto, S Identification of benzoxazin-3-one derivatives as novel, potent, and selective nonsteroidal mineralocorticoid receptor antagonists. J Med Chem54:8616-31 (2011) 
 
Mineralocorticoid receptor
Name:Mineralocorticoid receptor
Type:Enzyme
Mol. Mass.:107076.42
Organism:Homo sapiens (Human)
Description:P08235
Residue:984
BDBM50359651
NameBDBM50359651
Synonyms:CHEMBL1929041
TypeSmall organic molecule
Emp. Form.C19H12ClF4N3O2
Mol. Mass.425.764
SMILESCc1cc(F)ccc1-n1nc(cc1-c1cc(Cl)c2OCC(=O)Nc2c1)C(F)(F)F