Reaction Details
Target3-beta-hydroxysteroid-Delta(8),Delta(7)-isomerase
LigandBDBM50067013
Substrate/Competitorn/a
Meas. Tech.ChEMBL_792212 (CHEMBL1930739)
Ki 0.67±n/a nM
Citation Ferorelli, SAbate, CPedone, MPColabufo, NAContino, MPerrone, RBerardi, F Synthesis and binding assays of novel 3,3-dimethylpiperidine derivatives with various lipophilicities ass¿? receptor ligands. Bioorg Med Chem19:7612-22 (2011) 
 
3-beta-hydroxysteroid-Delta(8),Delta(7)-isomerase
Name:3-beta-hydroxysteroid-Delta(8),Delta(7)-isomerase
Type:PROTEIN
Mol. Mass.:26684.52
Organism:Cavia porcellus
Description:ChEMBL_203193
Residue:229
BDBM50067013
NameBDBM50067013
Synonyms:1-[4-(5-Methoxy-1,2,3,4-tetrahydro-naphthalen-1-yl)-butyl]-3,3-dimethyl-piperidine | CHEMBL128358
TypeSmall organic molecule
Emp. Form.C22H35NO
Mol. Mass.329.5194
SMILESCOc1cccc2C(CCCCN3CCCC(C)(C)C3)CCCc12