Reaction Details
Target3-beta-hydroxysteroid-Delta(8),Delta(7)-isomerase
LigandBDBM50419547
Substrate/Competitorn/a
Meas. Tech.ChEMBL_792212 (CHEMBL1930739)
Ki 2.11±n/a nM
Citation Ferorelli, SAbate, CPedone, MPColabufo, NAContino, MPerrone, RBerardi, F Synthesis and binding assays of novel 3,3-dimethylpiperidine derivatives with various lipophilicities ass¿? receptor ligands. Bioorg Med Chem19:7612-22 (2011) 
 
3-beta-hydroxysteroid-Delta(8),Delta(7)-isomerase
Name:3-beta-hydroxysteroid-Delta(8),Delta(7)-isomerase
Type:PROTEIN
Mol. Mass.:26684.52
Organism:Cavia porcellus
Description:ChEMBL_203193
Residue:229
BDBM50419547
NameBDBM50419547
Synonyms:CHEMBL1929280
TypeSmall organic molecule
Emp. Form.C20H33NS
Mol. Mass.319.548
SMILESCC1(C)CCCN(CCCCCC2CCCc3sccc23)C1