Reaction Details
Target3-beta-hydroxysteroid-Delta(8),Delta(7)-isomerase
LigandBDBM50419550
Substrate/Competitorn/a
Meas. Tech.ChEMBL_792212 (CHEMBL1930739)
Ki 3.8±n/a nM
Citation Ferorelli, SAbate, CPedone, MPColabufo, NAContino, MPerrone, RBerardi, F Synthesis and binding assays of novel 3,3-dimethylpiperidine derivatives with various lipophilicities ass¿? receptor ligands. Bioorg Med Chem19:7612-22 (2011) 
 
3-beta-hydroxysteroid-Delta(8),Delta(7)-isomerase
Name:3-beta-hydroxysteroid-Delta(8),Delta(7)-isomerase
Type:PROTEIN
Mol. Mass.:26684.52
Organism:Cavia porcellus
Description:ChEMBL_203193
Residue:229
BDBM50419550
NameBDBM50419550
Synonyms:CHEMBL1929287
TypeSmall organic molecule
Emp. Form.C17H33N
Mol. Mass.251.4506
SMILESCC1(C)CCCN(CCCCC2CCCCC2)C1