Reaction Details
TargetcGMP-specific 3',5'-cyclic phosphodiesterase
LigandBDBM50359783
Substrate/Competitorn/a
Meas. Tech.ChEMBL_791631 (CHEMBL1930855)
IC50 8.5±n/a nM
Citation Rawson, DJBallard, SBarber, CBarker, LBeaumont, KBunnage, MCole, SCorless, MDenton, SEllis, DFloc'h, MFoster, LGosset, JHolmwood, FLane, CLeahy, DMathias, JMaw, GMillion, WPoinsard, CPrice, JRussel, RStreet, SWatson, L The discovery of UK-369003, a novel PDE5 inhibitor with the potential for oral bioavailability and dose-proportional pharmacokinetics. Bioorg Med Chem20:498-509 (2011) 
 
cGMP-specific 3',5'-cyclic phosphodiesterase
Name:cGMP-specific 3',5'-cyclic phosphodiesterase
Type:Protein
Mol. Mass.:99975.83
Organism:Homo sapiens (Human)
Description:O76074
Residue:875
BDBM50359783
NameBDBM50359783
Synonyms:CHEMBL1928275
TypeSmall organic molecule
Emp. Form.C23H31N7O5S
Mol. Mass.517.601
SMILESCCN1CCN(CC1)S(=O)(=O)c1cnc(OCCOC)c(c1)-c1nc2c3CCCCn3nc2c(=O)[nH]1