Reaction Details
TargetcGMP-specific 3',5'-cyclic phosphodiesterase
LigandBDBM50359793
Substrate/Competitorn/a
Meas. Tech.ChEMBL_791631 (CHEMBL1930855)
IC50 2.9±n/a nM
Citation Rawson, DJBallard, SBarber, CBarker, LBeaumont, KBunnage, MCole, SCorless, MDenton, SEllis, DFloc'h, MFoster, LGosset, JHolmwood, FLane, CLeahy, DMathias, JMaw, GMillion, WPoinsard, CPrice, JRussel, RStreet, SWatson, L The discovery of UK-369003, a novel PDE5 inhibitor with the potential for oral bioavailability and dose-proportional pharmacokinetics. Bioorg Med Chem20:498-509 (2011) 
 
cGMP-specific 3',5'-cyclic phosphodiesterase
Name:cGMP-specific 3',5'-cyclic phosphodiesterase
Type:Protein
Mol. Mass.:99975.83
Organism:Homo sapiens (Human)
Description:O76074
Residue:875
BDBM50359793
NameBDBM50359793
Synonyms:CHEMBL1928256
TypeSmall organic molecule
Emp. Form.C24H35N7O5S
Mol. Mass.533.644
SMILESCCc1n(CC(C)C)nc2c1nc([nH]c2=O)-c1cc(cnc1OCCOC)S(=O)(=O)N1CCN(C)CC1