Reaction Details
TargetSerine/threonine-protein kinase Chk1
LigandBDBM50359807
Substrate/Competitorn/a
Meas. Tech.ChEMBL_791990 (CHEMBL1930050)
IC50 13±n/a nM
Citation Reader, JCMatthews, TPKlair, SCheung, KMScanlon, JProisy, NAddison, GEllard, JPiton, NTaylor, SCherry, MFisher, MBoxall, KBurns, SWalton, MIWestwood, IMHayes, AEve, PValenti, Mde Haven Brandon, ABox, Gvan Montfort, RLWilliams, DHAherne, GWRaynaud, FIEccles, SAGarrett, MDCollins, I Structure-guided evolution of potent and selective CHK1 inhibitors through scaffold morphing. J Med Chem54:8328-42 (2011) 
 
Serine/threonine-protein kinase Chk1
Name:Serine/threonine-protein kinase Chk1
Type:Enzyme Catalytic Domain
Mol. Mass.:54443.02
Organism:Homo sapiens (Human)
Description:gi_166295192
Residue:476
BDBM50359807
NameBDBM50359807
Synonyms:CHEMBL1928705
TypeSmall organic molecule
Emp. Form.C19H19ClN6O
Mol. Mass.382.847
SMILESC[C@H](CN(C)C)Oc1nc(Nc2cc3cccc(Cl)c3cn2)cnc1C#N