Reaction Details
TargetCasein kinase II subunit alpha
LigandBDBM50156669
Substrate/Competitorn/a
Meas. Tech.ChEMBL_792096 (CHEMBL1930358)
Ki 462±n/a nM
Citation Janeczko, MOrzeszko, AKazimierczuk, ZSzyszka, RBaier, A CK2a and CK2a' subunits differ in their sensitivity to 4,5,6,7-tetrabromo- and 4,5,6,7-tetraiodo-1H-benzimidazole derivatives. Eur J Med Chem47:345-50 (2012) 
 
Casein kinase II subunit alpha
Name:Casein kinase II subunit alpha
Type:Enzyme
Mol. Mass.:45151.12
Organism:Homo sapiens (Human)
Description:P68400
Residue:391
BDBM50156669
NameBDBM50156669
Synonyms:4,5,6,7-TETRABROMO-BENZIMIDAZOLE 4,5,6,7-tetrabromo-1H-benzo[d]imidazole 4,5,6,7-tetrabromobenzimidazole | CHEMBL373937
TypeSmall organic molecule
Emp. Form.C7H2Br4N2
Mol. Mass.433.72
SMILESBrc1c(Br)c(Br)c2[nH]cnc2c1Br