Reaction Details
TargetCasein kinase II subunit alpha
LigandBDBM34053
Substrate/Competitorn/a
Meas. Tech.ChEMBL_792096 (CHEMBL1930358)
Ki 110±n/a nM
Citation Janeczko, MOrzeszko, AKazimierczuk, ZSzyszka, RBaier, A CK2a and CK2a' subunits differ in their sensitivity to 4,5,6,7-tetrabromo- and 4,5,6,7-tetraiodo-1H-benzimidazole derivatives. Eur J Med Chem47:345-50 (2012) 
 
Casein kinase II subunit alpha
Name:Casein kinase II subunit alpha
Type:Enzyme
Mol. Mass.:45151.12
Organism:Homo sapiens (Human)
Description:P68400
Residue:391
BDBM34053
NameBDBM34053
Synonyms:iodinated benzimidazole, 16
TypeSmall organic molecule
Emp. Form.C9H4I4N2O2S
Mol. Mass.711.823
SMILESOC(=O)CSc1nc2c(I)c(I)c(I)c(I)c2[nH]1