Reaction Details
TargetCasein kinase II subunit alpha
LigandBDBM34055
Substrate/Competitorn/a
Meas. Tech.ChEMBL_792097 (CHEMBL1930359)
Ki 261±n/a nM
Citation Janeczko, MOrzeszko, AKazimierczuk, ZSzyszka, RBaier, A CK2a and CK2a' subunits differ in their sensitivity to 4,5,6,7-tetrabromo- and 4,5,6,7-tetraiodo-1H-benzimidazole derivatives. Eur J Med Chem47:345-50 (2012) 
 
Casein kinase II subunit alpha
Name:Casein kinase II subunit alpha
Type:Enzyme
Mol. Mass.:45151.12
Organism:Homo sapiens (Human)
Description:P68400
Residue:391
BDBM34055
NameBDBM34055
Synonyms:iodinated benzimidazole, 21
TypeSmall organic molecule
Emp. Form.C9H4I4N2O2
Mol. Mass.679.7581
SMILESOC(=O)Cn1cnc2c(I)c(I)c(I)c(I)c12