Reaction Details
TargetCasein kinase II subunit alpha'
LigandBDBM34038
Substrate/Competitorn/a
Meas. Tech.ChEMBL_792164 (CHEMBL1930611)
Ki 71±n/a nM
Citation Janeczko, MOrzeszko, AKazimierczuk, ZSzyszka, RBaier, A CK2a and CK2a' subunits differ in their sensitivity to 4,5,6,7-tetrabromo- and 4,5,6,7-tetraiodo-1H-benzimidazole derivatives. Eur J Med Chem47:345-50 (2012) 
 
Casein kinase II subunit alpha'
Name:Casein kinase II subunit alpha'
Type:Protein
Mol. Mass.:41223.82
Organism:Homo sapiens (Human)
Description:n/a
Residue:350
BDBM34038
NameBDBM34038
Synonyms:4,5,6,7-tetraiodobenzimidazole (TIBI), 1a
TypeSmall organic molecule
Emp. Form.C7H2I4N2
Mol. Mass.621.7221
SMILESIc1c(I)c(I)c2[nH]cnc2c1I