Reaction Details
TargetCasein kinase II subunit alpha'
LigandBDBM50359843
Substrate/Competitorn/a
Meas. Tech.ChEMBL_792164 (CHEMBL1930611)
Ki 100±n/a nM
Citation Janeczko, MOrzeszko, AKazimierczuk, ZSzyszka, RBaier, A CK2a and CK2a' subunits differ in their sensitivity to 4,5,6,7-tetrabromo- and 4,5,6,7-tetraiodo-1H-benzimidazole derivatives. Eur J Med Chem47:345-50 (2012) 
 
Casein kinase II subunit alpha'
Name:Casein kinase II subunit alpha'
Type:Protein
Mol. Mass.:41223.82
Organism:Homo sapiens (Human)
Description:n/a
Residue:350
BDBM50359843
NameBDBM50359843
Synonyms:CHEMBL1928906
TypeSmall organic molecule
Emp. Form.C11H8Br4N2O2S
Mol. Mass.551.874
SMILESCn1c(SCCC(O)=O)nc2c(Br)c(Br)c(Br)c(Br)c12