Reaction Details
TargetProstaglandin G/H synthase 1
LigandBDBM50359883
Substrate/Competitorn/a
Meas. Tech.ChEMBL_791244 (CHEMBL1929731)
IC50 310±n/a nM
Citation Eleftheriou, PGeronikaki, AHadjipavlou-Litina, DVicini, PFilz, OFilimonov, DPoroikov, VChaudhaery, SSRoy, KKSaxena, AK Fragment-based design, docking, synthesis, biological evaluation and structure-activity relationships of 2-benzo/benzisothiazolimino-5-aryliden-4-thiazolidinones as cycloxygenase/lipoxygenase inhibitors. Eur J Med Chem47:111-24 (2012) 
 
Prostaglandin G/H synthase 1
Name:Prostaglandin G/H synthase 1
Type:Protein
Mol. Mass.:68868.60
Organism:Ovis aries (Sheep)
Description:n/a
Residue:600
BDBM50359883
NameBDBM50359883
Synonyms:CHEMBL407152
TypeSmall organic molecule
Emp. Form.C17H10N4O3S2
Mol. Mass.382.416
SMILES[O-][N+](=O)c1cccc(\C=C2/S\C(NC2=O)=N\c2nc3ccccc3s2)c1