Reaction Details
Target5-hydroxytryptamine receptor 1A
LigandBDBM50359958
Substrate/Competitorn/a
Meas. Tech.ChEMBL_791368 (CHEMBL1930139)
Ki 30±n/a nM
Citation Fiorino, FSeverino, BMagli, EPerissutti, EFrecentese, FEsposito, AIncisivo, GMCiano, AMassarelli, PNencini, CSantagada, VCaliendo, G New potent 5-HT(2A) receptor ligands containing an N'-cyanopicolinamidine nucleus: Synthesis and in vitro pharmacological evaluation. Eur J Med Chem47:520-9 (2012) 
 
5-hydroxytryptamine receptor 1A
Name:5-hydroxytryptamine receptor 1A
Type:G Protein-Coupled Receptor (GPCR)
Mol. Mass.:46445.29
Organism:Rattus norvegicus (rat)
Description:Binding assays were performed using rat hippocampal membranes.
Residue:422
BDBM50359958
NameBDBM50359958
Synonyms:CHEMBL1927092
TypeSmall organic molecule
Emp. Form.C22H28N6
Mol. Mass.376.4979
SMILESCc1cccc(N2CCN(CCCN=C(NC#N)c3ccccn3)CC2)c1C