Reaction Details
Target5-hydroxytryptamine receptor 2A
LigandBDBM21395
Substrate/Competitorn/a
Meas. Tech.ChEMBL_791367 (CHEMBL1930138)
Ki 0.85±n/a nM
Citation Fiorino, FSeverino, BMagli, EPerissutti, EFrecentese, FEsposito, AIncisivo, GMCiano, AMassarelli, PNencini, CSantagada, VCaliendo, G New potent 5-HT(2A) receptor ligands containing an N'-cyanopicolinamidine nucleus: Synthesis and in vitro pharmacological evaluation. Eur J Med Chem47:520-9 (2012) 
 
5-hydroxytryptamine receptor 2A
Name:5-hydroxytryptamine receptor 2A
Type:G Protein-Coupled Receptor (GPCR)
Mol. Mass.:52852.05
Organism:Rattus norvegicus (rat)
Description:Rat cortex membranes 5-HT2A receptors.
Residue:471
BDBM21395
NameBDBM21395
Synonyms:3-(2-(4-(4-Fluorobenzoyl)piperidinol)ethyl)-2,4(1H,3H)-quinazolinedione CHEMBL1628637 Ketanserin R-41-468 [3H]-Ketanserin
Typeradiolabeled ligand
Emp. Form.C22H22FN3O3
Mol. Mass.395.4268
SMILESFc1ccc(cc1)C(=O)C1CCN(CCn2c(=O)[nH]c3ccccc3c2=O)CC1