Reaction Details
TargetCannabinoid receptor 1
LigandBDBM50360022
Substrate/Competitorn/a
Meas. Tech.ChEMBL_793705 (CHEMBL1932519)
Ki 7800±n/a nM
Citation Rogosch, TSinning, CPodlewski, AWatzer, BSchlosburg, JLichtman, AHCascio, MGBisogno, TDi Marzo, VNüsing, RImming, P Novel bioactive metabolites of dipyrone (metamizol). Bioorg Med Chem20:101-7 (2011) 
 
Cannabinoid receptor 1
Name:Cannabinoid receptor 1
Type:G Protein-Coupled Receptor (GPCR)
Mol. Mass.:52868.96
Organism:Homo sapiens (Human)
Description:P21554
Residue:472
BDBM50360022
NameBDBM50360022
Synonyms:CHEMBL1928336
TypeSmall organic molecule
Emp. Form.C32H45N3O2
Mol. Mass.503.7186
SMILESCCCCC\C=C/C\C=C/C\C=C/C\C=C/CCCC(=O)N(C)c1c(C)n(C)n(-c2ccccc2)c1=O