Reaction Details
TargetProstaglandin G/H synthase 1
LigandBDBM85515
Substrate/Competitorn/a
Meas. Tech.ChEMBL_793699 (CHEMBL1932513)
IC50 1000000±n/a nM
Citation Rogosch, TSinning, CPodlewski, AWatzer, BSchlosburg, JLichtman, AHCascio, MGBisogno, TDi Marzo, VNüsing, RImming, P Novel bioactive metabolites of dipyrone (metamizol). Bioorg Med Chem20:101-7 (2011) 
 
Prostaglandin G/H synthase 1
Name:Prostaglandin G/H synthase 1
Type:PROTEIN
Mol. Mass.:69044.61
Organism:Mus musculus
Description:ChEMBL_10575
Residue:602
BDBM85515
NameBDBM85515
Synonyms:Ampyrone EN300-17058 US11643395, Compound 9
TypeSmall organic molecule
Emp. Form.C11H13N3O
Mol. Mass.203.2404
SMILESCc1c(N)c(=O)n(-c2ccccc2)n1C