Reaction Details
TargetPhosphatidylinositol 4,5-bisphosphate 3-kinase catalytic subunit delta isoform
LigandBDBM50360088
Substrate/Competitorn/a
Meas. Tech.ChEMBL_793749 (CHEMBL1932610)
IC50 16±n/a nM
Citation Kendall, JDGiddens, ACTsang, KYFrédérick, RMarshall, ESSingh, RLill, CLLee, WJKolekar, SChao, MMalik, AYu, SChaussade, CBuchanan, CRewcastle, GWBaguley, BCFlanagan, JUJamieson, SMDenny, WAShepherd, PR Novel pyrazolo[1,5-a]pyridines as p110a-selective PI3 kinase inhibitors: Exploring the benzenesulfonohydrazide SAR. Bioorg Med Chem20:58-68 (2011) 
 
Phosphatidylinositol 4,5-bisphosphate 3-kinase catalytic subunit delta isoform
Name:Phosphatidylinositol 4,5-bisphosphate 3-kinase catalytic subunit delta isoform
Type:Enzyme Subunit
Mol. Mass.:119489.41
Organism:Homo sapiens (Human)
Description:O00329
Residue:1044
BDBM50360088
NameBDBM50360088
Synonyms:CHEMBL1928729
TypeSmall organic molecule
Emp. Form.C17H12N6O3
Mol. Mass.348.3156
SMILESCN(\N=C\c1cnn2ccc(cc12)C#N)C(=O)c1cccc(c1)[N+]([O-])=O