Reaction Details
TargetPhosphatidylinositol 4,5-bisphosphate 3-kinase catalytic subunit alpha isoform
LigandBDBM50360090
Substrate/Competitorn/a
Meas. Tech.ChEMBL_793747 (CHEMBL1932608)
IC50 0.5±n/a nM
Citation Kendall, JDGiddens, ACTsang, KYFrédérick, RMarshall, ESSingh, RLill, CLLee, WJKolekar, SChao, MMalik, AYu, SChaussade, CBuchanan, CRewcastle, GWBaguley, BCFlanagan, JUJamieson, SMDenny, WAShepherd, PR Novel pyrazolo[1,5-a]pyridines as p110a-selective PI3 kinase inhibitors: Exploring the benzenesulfonohydrazide SAR. Bioorg Med Chem20:58-68 (2011) 
 
Phosphatidylinositol 4,5-bisphosphate 3-kinase catalytic subunit alpha isoform
Name:Phosphatidylinositol 4,5-bisphosphate 3-kinase catalytic subunit alpha isoform
Type:Enzyme Subunit
Mol. Mass.:124294.87
Organism:Homo sapiens (Human)
Description:P42336
Residue:1068
BDBM50360090
NameBDBM50360090
Synonyms:CHEMBL1928555
TypeSmall organic molecule
Emp. Form.C18H16N6O4S
Mol. Mass.412.422
SMILESCCN(\N=C\c1cnn2ccc(cc12)C#N)S(=O)(=O)c1cc(ccc1C)[N+]([O-])=O