Reaction Details
TargetSerine/threonine-protein kinase mTOR
LigandBDBM50360063
Substrate/Competitorn/a
Meas. Tech.ChEMBL_793784 (CHEMBL1932645)
IC50 234±n/a nM
Citation Kendall, JDGiddens, ACTsang, KYFrédérick, RMarshall, ESSingh, RLill, CLLee, WJKolekar, SChao, MMalik, AYu, SChaussade, CBuchanan, CRewcastle, GWBaguley, BCFlanagan, JUJamieson, SMDenny, WAShepherd, PR Novel pyrazolo[1,5-a]pyridines as p110a-selective PI3 kinase inhibitors: Exploring the benzenesulfonohydrazide SAR. Bioorg Med Chem20:58-68 (2011) 
 
Serine/threonine-protein kinase mTOR
Name:Serine/threonine-protein kinase mTOR
Type:Rapamycin target protein
Mol. Mass.:288917.12
Organism:Homo sapiens (Human)
Description:P42345
Residue:2549
BDBM50360063
NameBDBM50360063
Synonyms:CHEMBL1928561
TypeSmall organic molecule
Emp. Form.C18H16N6O5S
Mol. Mass.428.422
SMILESCc1ccc(cc1S(=O)(=O)N(CCO)\N=C\c1cnn2ccc(cc12)C#N)[N+]([O-])=O