Reaction Details
TargetHypoxanthine-guanine phosphoribosyltransferase
LigandBDBM50039555
Substrate/Competitorn/a
Meas. Tech.ChEMBL_793806 (CHEMBL1932721)
Ki>100000±n/a nM
Citation Cesnek, MHocková, DHolý, ADracínský, MBaszczynski, OJersey, JdKeough, DTGuddat, LW Synthesis of 9-phosphonoalkyl and 9-phosphonoalkoxyalkyl purines: evaluation of their ability to act as inhibitors of Plasmodium falciparum, Plasmodium vivax and human hypoxanthine-guanine-(xanthine) phosphoribosyltransferases. Bioorg Med Chem20:1076-89 (2012) 
 
Hypoxanthine-guanine phosphoribosyltransferase
Name:Hypoxanthine-guanine phosphoribosyltransferase
Type:Protein
Mol. Mass.:24579.61
Organism:Homo sapiens (Human)
Description:P00492
Residue:218
BDBM50039555
NameBDBM50039555
Synonyms:CHEMBL13130 | [5-(6-Oxo-1,6-dihydro-purin-9-yl)-pentyl]-phosphonic acid
TypeSmall organic molecule
Emp. Form.C10H15N4O4P
Mol. Mass.286.2243
SMILESOP(O)(=O)CCCCCn1cnc2c1nc[nH]c2=O