Reaction Details
TargetHypoxanthine-guanine phosphoribosyltransferase
LigandBDBM50049962
Substrate/Competitorn/a
Meas. Tech.ChEMBL_793806 (CHEMBL1932721)
Ki 5000±n/a nM
Citation Cesnek, MHocková, DHolý, ADracínský, MBaszczynski, OJersey, JdKeough, DTGuddat, LW Synthesis of 9-phosphonoalkyl and 9-phosphonoalkoxyalkyl purines: evaluation of their ability to act as inhibitors of Plasmodium falciparum, Plasmodium vivax and human hypoxanthine-guanine-(xanthine) phosphoribosyltransferases. Bioorg Med Chem20:1076-89 (2012) 
 
Hypoxanthine-guanine phosphoribosyltransferase
Name:Hypoxanthine-guanine phosphoribosyltransferase
Type:Protein
Mol. Mass.:24579.61
Organism:Homo sapiens (Human)
Description:P00492
Residue:218
BDBM50049962
NameBDBM50049962
Synonyms:CHEMBL172844 | [7-(2-Amino-6-oxo-1,6-dihydro-purin-9-yl)-heptyl]-phosphonic acid
TypeSmall organic molecule
Emp. Form.C12H20N5O4P
Mol. Mass.329.2921
SMILESNc1nc2n(CCCCCCCP(O)(O)=O)cnc2c(=O)[nH]1