Reaction Details
TargetDelta-type opioid receptor
LigandBDBM50294426
Substrate/Competitorn/a
Meas. Tech.ChEMBL_793549 (CHEMBL1932300)
EC50 0.018000±n/a nM
Citation Ida, YNemoto, THirayama, SFujii, HOsa, YImai, MNakamura, TKanemasa, TKato, ANagase, H Synthesis of quinolinomorphinan-4-ol derivatives asd opioid receptor agonists. Bioorg Med Chem20:949-61 (2012) 
 
Delta-type opioid receptor
Name:Delta-type opioid receptor
Type:G Protein-Coupled Receptor (GPCR)
Mol. Mass.:40382.98
Organism:Homo sapiens (Human)
Description:Competition binding assays were carried out using membrane preparations from transfected HN9.10 cells that constitutively expressed the delta opioid receptor.
Residue:372
BDBM50294426
NameBDBM50294426
Synonyms:CHEMBL559518 | SN-11
TypeSmall organic molecule
Emp. Form.C27H28N2O
Mol. Mass.396.524
SMILESOc1ccc2C[C@@H]3[C@@H]4Cc5cc6ccccc6nc5C[C@]4(CCN3CC3CC3)c2c1