Reaction Details
TargetProstaglandin E2 receptor EP4 subtype
LigandBDBM50360166
Substrate/Competitorn/a
Meas. Tech.ChEMBL_793560 (CHEMBL1932311)
Ki 2±n/a nM
Citation Kambe, TMaruyama, TNagase, TOgawa, SMinamoto, CSakata, KMaruyama, TNakai, HToda, M Synthesis and evaluation of novel modified¿-lactam prostanoids as EP4 subtype-selective agonists. Bioorg Med Chem20:702-13 (2012) 
 
Prostaglandin E2 receptor EP4 subtype
Name:Prostaglandin E2 receptor EP4 subtype
Type:G-protein coupled receptor
Mol. Mass.:56175.66
Organism:Mus musculus (Mouse)
Description:n/a
Residue:513
BDBM50360166
NameBDBM50360166
Synonyms:CHEMBL1929533
TypeSmall organic molecule
Emp. Form.C20H24F3NO5S
Mol. Mass.447.468
SMILESO[C@@H](Cc1cccc(c1)C(F)(F)F)\C=C\[C@H]1COC(=O)N1CCSCCCC(O)=O