Reaction Details
TargetProstaglandin E2 receptor EP4 subtype
LigandBDBM50360148
Substrate/Competitorn/a
Meas. Tech.ChEMBL_793560 (CHEMBL1932311)
Ki 0.88±n/a nM
Citation Kambe, TMaruyama, TNagase, TOgawa, SMinamoto, CSakata, KMaruyama, TNakai, HToda, M Synthesis and evaluation of novel modified¿-lactam prostanoids as EP4 subtype-selective agonists. Bioorg Med Chem20:702-13 (2012) 
 
Prostaglandin E2 receptor EP4 subtype
Name:Prostaglandin E2 receptor EP4 subtype
Type:G-protein coupled receptor
Mol. Mass.:56175.66
Organism:Mus musculus (Mouse)
Description:n/a
Residue:513
BDBM50360148
NameBDBM50360148
Synonyms:CHEMBL1929540
TypeSmall organic molecule
Emp. Form.C21H29NO4S2
Mol. Mass.423.589
SMILESCCc1cccc(C[C@H](O)\C=C\[C@H]2CSC(=O)N2CCSCCCC(O)=O)c1