Reaction Details
TargetCholecystokinin receptor type A
LigandBDBM50360276
Substrate/Competitorn/a
Meas. Tech.ChEMBL_796477 (CHEMBL1937792)
Ki 5.8±n/a nM
Citation Pavan, MVLassiani, LBerti, FStefancich, GCiogli, AGasparrini, FMennuni, LFerrari, FEscrieut, CMarco, EMakovec, FFourmy, DVarnavas, A New anthranilic acid based antagonists with high affinity and selectivity for the human cholecystokinin receptor 1 (hCCK1-R). J Med Chem54:5769-85 (2011) 
 
Cholecystokinin receptor type A
Name:Cholecystokinin receptor type A
Type:G Protein-Coupled Receptor (GPCR)
Mol. Mass.:47859.34
Organism:Homo sapiens (Human)
Description:Stable expression of human CCK-1 receptors in HEK 293 cells.
Residue:428
BDBM50360276
NameBDBM50360276
Synonyms:CHEMBL1933104
TypeSmall organic molecule
Emp. Form.C26H23N3O4
Mol. Mass.441.4785
SMILESOC(=O)[C@@H](CCc1ccccc1)NC(=O)c1ccccc1NC(=O)c1cc2ccccc2[nH]1