Reaction Details
TargetRibosomal protein S6 kinase alpha-3
LigandBDBM50360303
Substrate/Competitorn/a
Meas. Tech.ChEMBL_795811 (CHEMBL1936698)
IC50 290±n/a nM
Citation Kirrane, TMBoyer, SJBurke, JGuo, XSnow, RJSoleymanzadeh, LSwinamer, AZhang, YMadwed, JBKashem, MKugler, SO'Neill, MM Indole RSK inhibitors. Part 2: optimization of cell potency and kinase selectivity. Bioorg Med Chem Lett22:738-42 (2011) 
 
Ribosomal protein S6 kinase alpha-3
Name:Ribosomal protein S6 kinase alpha-3
Type:Serine/threonine-protein kinase
Mol. Mass.:83740.03
Organism:Homo sapiens (Human)
Description:The human RSK2 sequence differed from the Genbank entry NM_004586 at one residue, V45G. The protein was cloned and purified from baculovirus expression system.
Residue:740
BDBM50360303
NameBDBM50360303
Synonyms:CHEMBL1933290 | US9150577, 99
TypeSmall organic molecule
Emp. Form.C27H32N6O2
Mol. Mass.472.582
SMILESCN(C)CCCn1c(NC(=O)c2ccc3cc4C(=O)NCC(C)(C)Cn4c3c2)nc2ccccc12