Reaction Details
TargetAromatase
LigandBDBM50360384
Substrate/Competitorn/a
Meas. Tech.ChEMBL_795893 (CHEMBL1936457)
Ki 250±n/a nM
Citation McNulty, JNair, JJVurgun, NDifrancesco, BRBrown, CETsoi, BCrankshaw, DJHolloway, AC Discovery of a novel class of aldol-derived 1,2,3-triazoles: potent and selective inhibitors of human cytochrome P450 19A1 (aromatase). Bioorg Med Chem Lett22:718-22 (2011) 
 
Aromatase
Name:Aromatase
Type:Enzyme
Mol. Mass.:57888.92
Organism:Homo sapiens (Human)
Description:P11511
Residue:503
BDBM50360384
NameBDBM50360384
Synonyms:CHEMBL1933701
TypeSmall organic molecule
Emp. Form.C19H19N3O2
Mol. Mass.321.3731
SMILESCC(=O)O[C@@H]([C@@H](Cn1ccnn1)c1ccccc1)c1ccccc1