Reaction Details
TargetCytochrome P450 1A1
LigandBDBM50360380
Substrate/Competitorn/a
Meas. Tech.ChEMBL_795896 (CHEMBL1936460)
Ki 30902.95±n/a nM
Citation McNulty, JNair, JJVurgun, NDifrancesco, BRBrown, CETsoi, BCrankshaw, DJHolloway, AC Discovery of a novel class of aldol-derived 1,2,3-triazoles: potent and selective inhibitors of human cytochrome P450 19A1 (aromatase). Bioorg Med Chem Lett22:718-22 (2011) 
 
Cytochrome P450 1A1
Name:Cytochrome P450 1A1
Type:Protein
Mol. Mass.:58177.23
Organism:Homo sapiens (Human)
Description:P04798
Residue:512
BDBM50360380
NameBDBM50360380
Synonyms:CHEMBL1933693
TypeSmall organic molecule
Emp. Form.C24H21N3O2
Mol. Mass.383.4424
SMILESO=C(O[C@H]([C@@H](Cn1ccnn1)c1ccccc1)c1ccccc1)c1ccccc1