Reaction Details
TargetB1 bradykinin receptor
LigandBDBM50360417
Substrate/Competitorn/a
Meas. Tech.ChEMBL_796433 (CHEMBL1937748)
Ki 15±n/a nM
Citation Bryan, MCBiswas, KPeterkin, TARzasa, RMArik, LLehto, SGSun, HHsieh, FYXu, CFremeau, RTAllen, JR Chromenones as potent bradykinin B1 antagonists. Bioorg Med Chem Lett22:619-22 (2011) 
 
B1 bradykinin receptor
Name:B1 bradykinin receptor
Type:Enzyme
Mol. Mass.:40508.87
Organism:Homo sapiens (Human)
Description:P46663
Residue:353
BDBM50360417
NameBDBM50360417
Synonyms:CHEMBL1934265
TypeSmall organic molecule
Emp. Form.C33H34N2O3
Mol. Mass.506.6347
SMILESCc1cccc2occ(-c3ccc(cc3)C(=O)N[C@H]3CCCc4cc(CN5CCCCC5)ccc34)c(=O)c12