Reaction Details
TargetB1 bradykinin receptor
LigandBDBM50360420
Substrate/Competitorn/a
Meas. Tech.ChEMBL_796434 (CHEMBL1937749)
IC50 17±n/a nM
Citation Bryan, MCBiswas, KPeterkin, TARzasa, RMArik, LLehto, SGSun, HHsieh, FYXu, CFremeau, RTAllen, JR Chromenones as potent bradykinin B1 antagonists. Bioorg Med Chem Lett22:619-22 (2011) 
 
B1 bradykinin receptor
Name:B1 bradykinin receptor
Type:Enzyme
Mol. Mass.:40508.87
Organism:Homo sapiens (Human)
Description:P46663
Residue:353
BDBM50360420
NameBDBM50360420
Synonyms:CHEMBL1934254
TypeSmall organic molecule
Emp. Form.C32H31ClN2O3
Mol. Mass.527.053
SMILESClc1cccc2occ(-c3cccc(c3)C(=O)N[C@@H]3CCCc4cc(CN5CCCCC5)ccc34)c(=O)c12