Reaction Details
TargetB1 bradykinin receptor
LigandBDBM50360414
Substrate/Competitorn/a
Meas. Tech.ChEMBL_796434 (CHEMBL1937749)
IC50 264±n/a nM
Citation Bryan, MCBiswas, KPeterkin, TARzasa, RMArik, LLehto, SGSun, HHsieh, FYXu, CFremeau, RTAllen, JR Chromenones as potent bradykinin B1 antagonists. Bioorg Med Chem Lett22:619-22 (2011) 
 
B1 bradykinin receptor
Name:B1 bradykinin receptor
Type:Enzyme
Mol. Mass.:40508.87
Organism:Homo sapiens (Human)
Description:P46663
Residue:353
BDBM50360414
NameBDBM50360414
Synonyms:CHEMBL1934262
TypeSmall organic molecule
Emp. Form.C32H31ClN2O3
Mol. Mass.527.053
SMILESClc1ccc2c(c1)occ(-c1ccc(cc1)C(=O)N[C@H]1CCCc3cc(CN4CCCCC4)ccc13)c2=O