Reaction Details
TargetHemagglutinin
LigandBDBM50360450
Substrate/Competitorn/a
Meas. Tech.ChEMBL_795514 (CHEMBL1935837)
IC50 7810±n/a nM
Citation Suzuki, KKoyama, TYingsakmongkon, SSuzuki, YHatano, KMatsuoka, K Synthesis and biological evaluation of sialic acid derivatives containing a long hydrophobic chain at the anomeric position and their C-5 linked polymers as potent influenza virus inhibitors. Bioorg Med Chem20:446-54 (2011) 
 
Hemagglutinin
Name:Hemagglutinin
Type:PROTEIN
Mol. Mass.:63355.67
Organism:Influenza A virus (strain A/Puerto Rico/8/1934 H1N1)
Description:ChEMBL_795514
Residue:565
BDBM50360450
NameBDBM50360450
Synonyms:CHEMBL1934618
TypeSmall organic molecule
Emp. Form.C24H43NO8S
Mol. Mass.505.665
SMILESCCCCCCCCCCCCS[C@@]1(C[C@H](O)[C@@H](NC(=O)C=C)[C@@H](O1)[C@H](O)[C@H](O)CO)C(O)=O