Reaction Details
TargetNeuraminidase
LigandBDBM50360450
Substrate/Competitorn/a
Meas. Tech.ChEMBL_795431 (CHEMBL1937380)
EC50 1347060±n/a nM
Citation Suzuki, KKoyama, TYingsakmongkon, SSuzuki, YHatano, KMatsuoka, K Synthesis and biological evaluation of sialic acid derivatives containing a long hydrophobic chain at the anomeric position and their C-5 linked polymers as potent influenza virus inhibitors. Bioorg Med Chem20:446-54 (2011) 
 
Neuraminidase
Name:Neuraminidase
Type:Enzyme
Mol. Mass.:50124.14
Organism:Influenza A virus (A/Puerto Rico/8/34/Mount Sinai(H1N1))
Description:P03468
Residue:454
BDBM50360450
NameBDBM50360450
Synonyms:CHEMBL1934618
TypeSmall organic molecule
Emp. Form.C24H43NO8S
Mol. Mass.505.665
SMILESCCCCCCCCCCCCS[C@@]1(C[C@H](O)[C@@H](NC(=O)C=C)[C@@H](O1)[C@H](O)[C@H](O)CO)C(O)=O